Reaction Details
TargetFructose-bisphosphate aldolase, glycosomal
LigandBDBM50330437
Substrate/Competitorn/a
Meas. Tech.ChEMBL_813853 (CHEMBL2020222)
IC50 10000±n/a nM
Citation Mabiala-Bassiloua, CGArthus-Cartier, GHannaert, VThérisod, HSygusch, JThérisod, M Mannitol Bis-phosphate Based Inhibitors of Fructose 1,6-Bisphosphate Aldolases. ACS Med Chem Lett2:804-808 (2011) 
 
Fructose-bisphosphate aldolase, glycosomal
Name:Fructose-bisphosphate aldolase, glycosomal
Type:PROTEIN
Mol. Mass.:41192.02
Organism:Trypanosoma brucei brucei
Description:ChEMBL_813853
Residue:372
BDBM50330437
NameBDBM50330437
Synonyms:1,6-di-O-phosphono-D-fructose CHEMBL1235112
TypeSmall organic molecule
Emp. Form.C6H14O12P2
Mol. Mass.340.1157
SMILESOC(COP(O)(O)=O)[C@@H](O)C(=O)[C@H](O)COP(O)(O)=O