Reaction Details
TargetFructose-bisphosphate aldolase, glycosomal
LigandBDBM50380325
Substrate/Competitorn/a
Meas. Tech.ChEMBL_813853 (CHEMBL2020222)
IC50 117000±n/a nM
Citation Mabiala-Bassiloua, CGArthus-Cartier, GHannaert, VThérisod, HSygusch, JThérisod, M Mannitol Bis-phosphate Based Inhibitors of Fructose 1,6-Bisphosphate Aldolases. ACS Med Chem Lett2:804-808 (2011) 
 
Fructose-bisphosphate aldolase, glycosomal
Name:Fructose-bisphosphate aldolase, glycosomal
Type:PROTEIN
Mol. Mass.:41192.02
Organism:Trypanosoma brucei brucei
Description:ChEMBL_813853
Residue:372
BDBM50380325
NameBDBM50380325
Synonyms:CHEMBL2017787
TypeSmall organic molecule
Emp. Form.C11H26O12P2
Mol. Mass.412.2645
SMILESCCCCCO[C@H](COP(O)(O)=O)[C@@H](O)[C@H](O)[C@H](O)COP(O)(O)=O