Reaction Details
TargetSphingosine 1-phosphate receptor 3
LigandBDBM50380340
Substrate/Competitorn/a
Meas. Tech.ChEMBL_812704 (CHEMBL2019205)
EC50>25000±n/a nM
Citation Pennington, LDSham, KKPickrell, AJHarrington, PEFrohn, MJLanman, BAReed, ABCroghan, MDLee, MRXu, HMcElvain, MXu, YZhang, XFiorino, MHorner, MMorrison, HGArnett, HAFotsch, CWong, MCee, VJ 4-Methoxy-N-[2-(trifluoromethyl)biphenyl-4-ylcarbamoyl]nicotinamide: A Potent and Selective Agonist of S1P1. ACS Med Chem Lett2:752-757 (2011) 
 
Sphingosine 1-phosphate receptor 3
Name:Sphingosine 1-phosphate receptor 3
Type:G Protein-Coupled Receptor (GPCR)
Mol. Mass.:42278.13
Organism:Homo sapiens (Human)
Description:Q99500
Residue:378
BDBM50380340
NameBDBM50380340
Synonyms:CHEMBL2017803
TypeSmall organic molecule
Emp. Form.C20H22ClN3O2S
Mol. Mass.403.926
SMILESCOc1ccccc1C(=O)NC(=S)Nc1ccc(N2CCCCC2)c(Cl)c1