Reaction Details
TargetSphingosine 1-phosphate receptor 1
LigandBDBM50380346
Substrate/Competitorn/a
Meas. Tech.ChEMBL_813865 (CHEMBL2020234)
EC50 38±n/a nM
Citation Pennington, LDSham, KKPickrell, AJHarrington, PEFrohn, MJLanman, BAReed, ABCroghan, MDLee, MRXu, HMcElvain, MXu, YZhang, XFiorino, MHorner, MMorrison, HGArnett, HAFotsch, CWong, MCee, VJ 4-Methoxy-N-[2-(trifluoromethyl)biphenyl-4-ylcarbamoyl]nicotinamide: A Potent and Selective Agonist of S1P1. ACS Med Chem Lett2:752-757 (2011) 
 
Sphingosine 1-phosphate receptor 1
Name:Sphingosine 1-phosphate receptor 1
Type:Enzyme
Mol. Mass.:42836.02
Organism:Homo sapiens (Human)
Description:P21453
Residue:382
BDBM50380346
NameBDBM50380346
Synonyms:CHEMBL2017809
TypeSmall organic molecule
Emp. Form.C19H14F3N3O3S
Mol. Mass.421.393
SMILESCOc1ccccc1C(=O)NC(=O)Nc1ccc(-c2nccs2)c(c1)C(F)(F)F