Reaction Details
TargetPotassium voltage-gated channel subfamily H member 2
LigandBDBM50361891
Substrate/Competitorn/a
Meas. Tech.ChEMBL_812720 (CHEMBL2019938)
IC50>10000±n/a nM
Citation Pennington, LDSham, KKPickrell, AJHarrington, PEFrohn, MJLanman, BAReed, ABCroghan, MDLee, MRXu, HMcElvain, MXu, YZhang, XFiorino, MHorner, MMorrison, HGArnett, HAFotsch, CWong, MCee, VJ 4-Methoxy-N-[2-(trifluoromethyl)biphenyl-4-ylcarbamoyl]nicotinamide: A Potent and Selective Agonist of S1P1. ACS Med Chem Lett2:752-757 (2011) 
 
Potassium voltage-gated channel subfamily H member 2
Name:Potassium voltage-gated channel subfamily H member 2
Type:Multi-pass membrane protein
Mol. Mass.:126672.65
Organism:Homo sapiens (Human)
Description:Q12809
Residue:1159
BDBM50361891
NameBDBM50361891
Synonyms:CHEMBL1938952
TypeSmall organic molecule
Emp. Form.C21H16F3N3O3
Mol. Mass.415.3652
SMILESCOc1ccncc1C(=O)NC(=O)Nc1ccc(-c2ccccc2)c(c1)C(F)(F)F