Reaction Details
TargetBreast cancer type 1 susceptibility protein
LigandBDBM50345641
Substrate/Competitorn/a
Meas. Tech.ChEMBL_812733 (CHEMBL2019951)
Ki 200±n/a nM
Citation Yuan, ZKumar, EACampbell, SJPalermo, NYKizhake, SMark Glover, JNNatarajan, A Exploiting the P-1 pocket of BRCT domains toward a structure guided inhibitor design. ACS Med Chem Lett2:764-767 (2011) 
 
Breast cancer type 1 susceptibility protein
Name:Breast cancer type 1 susceptibility protein
Type:PROTEIN
Mol. Mass.:207672.68
Organism:Homo sapiens (Human)
Description:ChEMBL_812733
Residue:1863
BDBM50345641
NameBDBM50345641
Synonyms:(S)-2-((S)-2-((S)-1-((S)-2-acetamido-3-(phosphonooxy)propanoyl)pyrrolidine-2-carboxamido)-3-methylbutanamido)-3-phenylpropanoic acid | CHEMBL1784785
TypeSmall organic molecule
Emp. Form.C24H35N4O10P
Mol. Mass.570.5293
SMILESCC(C)[C@H](NC(=O)[C@@H]1CCCN1C(=O)[C@H](COP(O)(O)=O)NC(C)=O)C(=O)N[C@@H](Cc1ccccc1)C(O)=O