Reaction Details
TargetPhosphatidylinositol 4,5-bisphosphate 3-kinase catalytic subunit alpha isoform
LigandBDBM50380367
Substrate/Competitorn/a
Meas. Tech.ChEMBL_812833 (CHEMBL2020154)
IC50 4.1±n/a nM
Citation Burger, MTPecchi, SWagman, ANi, ZJKnapp, MHendrickson, TAtallah, GPfister, KZhang, YBartulis, SFrazier, KNg, SSmith, AVerhagen, JHaznedar, JHuh, KIwanowicz, EXin, XMenezes, DMerritt, HLee, IWiesmann, MKaufman, SCrawford, KChin, MBussiere, DShoemaker, KZaror, IMaira, SMVoliva, CF Identification of NVP-BKM120 as a Potent, Selective, Orally Bioavailable Class I PI3 Kinase Inhibitor for Treating Cancer. ACS Med Chem Lett2:774-779 (2011) 
 
Phosphatidylinositol 4,5-bisphosphate 3-kinase catalytic subunit alpha isoform
Name:Phosphatidylinositol 4,5-bisphosphate 3-kinase catalytic subunit alpha isoform
Type:Enzyme Subunit
Mol. Mass.:124294.87
Organism:Homo sapiens (Human)
Description:P42336
Residue:1068
BDBM50380367
NameBDBM50380367
Synonyms:CHEMBL2017966
TypeSmall organic molecule
Emp. Form.C23H20N8O
Mol. Mass.424.4579
SMILESNc1cc(C#N)c(cn1)-c1cc(Nc2cnc3ccccc3c2)nc(n1)N1CCOCC1