Reaction Details
TargetNucleotide-binding oligomerization domain-containing protein 2
LigandBDBM62240
Substrate/Competitorn/a
Meas. Tech.ChEMBL_812916 (CHEMBL2020291)
IC50 1850±n/a nM
Citation Khan, PMCorrea, RGDivlianska, DBPeddibhotla, SSessions, EHMagnuson, GBrown, BSuyama, EYuan, HMangravita-Novo, AVicchiarelli, MSu, YVasile, SSmith, LHDiaz, PWReed, JCRoth, GP Identification of Inhibitors of NOD1-Induced Nuclear Factor-żB Activation. ACS Med Chem Lett2:780-785 (2011) 
 
Nucleotide-binding oligomerization domain-containing protein 2
Name:Nucleotide-binding oligomerization domain-containing protein 2
Type:PROTEIN
Mol. Mass.:115287.18
Organism:Homo sapiens (Human)
Description:ChEMBL_1454053
Residue:1040
BDBM62240
NameBDBM62240
Synonyms:4-(3,4-dihydro-1H-isoquinolin-2-ylmethyl)-N-(4-fluorophenyl)benzamide cid_1142837
TypeSmall organic molecule
Emp. Form.C23H21FN2O
Mol. Mass.360.424
SMILESFc1ccc(NC(=O)c2ccc(CN3CCc4ccccc4C3)cc2)cc1