Reaction Details
TargetHistone deacetylase 6
LigandBDBM50380384
Substrate/Competitorn/a
Meas. Tech.ChEMBL_812982 (CHEMBL2020396)
IC50 0.972±n/a nM
Citation Kalin, JHButler, KVAkimova, THancock, WWKozikowski, AP Second-generation histone deacetylase 6 inhibitors enhance the immunosuppressive effects of Foxp3+ T-regulatory cells. J Med Chem55:639-51 (2012) 
 
Histone deacetylase 6
Name:Histone deacetylase 6
Type:Chromatin regulator; hydrolase; repressor
Mol. Mass.:131381.51
Organism:Homo sapiens (Human)
Description:Q9UBN7
Residue:1215
BDBM50380384
NameBDBM50380384
Synonyms:CHEMBL2018442
TypeSmall organic molecule
Emp. Form.C22H23N3O2
Mol. Mass.361.4369
SMILESONC(=O)c1ccc(Cn2c3CCN(CC=C)Cc3c3ccccc23)cc1