Reaction Details
TargetHistone deacetylase 6
LigandBDBM50380401
Substrate/Competitorn/a
Meas. Tech.ChEMBL_812982 (CHEMBL2020396)
IC50 1.02±n/a nM
Citation Kalin, JHButler, KVAkimova, THancock, WWKozikowski, AP Second-generation histone deacetylase 6 inhibitors enhance the immunosuppressive effects of Foxp3+ T-regulatory cells. J Med Chem55:639-51 (2012) 
 
Histone deacetylase 6
Name:Histone deacetylase 6
Type:Chromatin regulator; hydrolase; repressor
Mol. Mass.:131381.51
Organism:Homo sapiens (Human)
Description:Q9UBN7
Residue:1215
BDBM50380401
NameBDBM50380401
Synonyms:CHEMBL2018300
TypeSmall organic molecule
Emp. Form.C20H20ClN3O2
Mol. Mass.369.845
SMILESCN1CCc2c(C1)c1cc(Cl)ccc1n2Cc1ccc(cc1)C(=O)NO