Reaction Details
TargetSodium channel protein type 5 subunit alpha
LigandBDBM50117271
Substrate/Competitorn/a
Meas. Tech.ChEMBL_812997 (CHEMBL2020459)
IC50 420000±n/a nM
Citation Catalano, ADesaphy, JFLentini, GCarocci, ADi Mola, ABruno, CCarbonara, RDe Palma, ABudriesi, RGhelardini, CPerrone, MGColabufo, NAConte Camerino, DFranchini, C Synthesis and toxicopharmacological evaluation of m-hydroxymexiletine, the first metabolite of mexiletine more potent than the parent compound on voltage-gated sodium channels. J Med Chem55:1418-22 (2012) 
 
Sodium channel protein type 5 subunit alpha
Name:Sodium channel protein type 5 subunit alpha
Type:Enzyme
Mol. Mass.:226908.60
Organism:Homo sapiens (Human)
Description:Q14524
Residue:2016
BDBM50117271
NameBDBM50117271
Synonyms:1-(2,6-dimethylphenoxy)-2-propanolamine 2-(2,6-Dimethyl-phenoxy)-1-methyl-ethylamine CHEMBL558 Mexitil
TypeSmall organic molecule
Emp. Form.C11H17NO
Mol. Mass.179.2588
SMILESCC(N)COc1c(C)cccc1C