Reaction Details
TargetCytochrome P450 2B6
LigandBDBM50380527
Substrate/Competitorn/a
Meas. Tech.ChEMBL_813099 (CHEMBL2020718)
IC50 5500±n/a nM
Citation Foti, RSRock, DAHan, XFlowers, RAWienkers, LCWahlstrom, JL Ligand-based design of a potent and selective inhibitor of cytochrome P450 2C19. J Med Chem55:1205-14 (2012) 
 
Cytochrome P450 2B6
Name:Cytochrome P450 2B6
Type:Protein
Mol. Mass.:56289.75
Organism:Homo sapiens (Human)
Description:P20813
Residue:491
BDBM50380527
NameBDBM50380527
Synonyms:CHEMBL2018913
TypeSmall organic molecule
Emp. Form.C11H14N2O2S
Mol. Mass.238.306
SMILESCOc1ccc2nc(SCCCO)[nH]c2c1