Reaction Details
TargetCytochrome P450 2C8
LigandBDBM50275736
Substrate/Competitorn/a
Meas. Tech.ChEMBL_813100 (CHEMBL2020719)
IC50 510±n/a nM
Citation Foti, RSRock, DAHan, XFlowers, RAWienkers, LCWahlstrom, JL Ligand-based design of a potent and selective inhibitor of cytochrome P450 2C19. J Med Chem55:1205-14 (2012) 
 
Cytochrome P450 2C8
Name:Cytochrome P450 2C8
Type:Protein
Mol. Mass.:55839.23
Organism:Homo sapiens (Human)
Description:P10632
Residue:490
BDBM50275736
NameBDBM50275736
Synonyms:6-methoxy-2-(naphthalen-2-ylmethylthio)-1H-benzo[d]imidazole | CHEMBL502335
TypeSmall organic molecule
Emp. Form.C19H16N2OS
Mol. Mass.320.408
SMILESCOc1ccc2nc(SCc3ccc4ccccc4c3)[nH]c2c1