Reaction Details
TargetCytochrome P450 2E1
LigandBDBM50380515
Substrate/Competitorn/a
Meas. Tech.ChEMBL_813104 (CHEMBL2020723)
IC50 50000±n/a nM
Citation Foti, RSRock, DAHan, XFlowers, RAWienkers, LCWahlstrom, JL Ligand-based design of a potent and selective inhibitor of cytochrome P450 2C19. J Med Chem55:1205-14 (2012) 
 
Cytochrome P450 2E1
Name:Cytochrome P450 2E1
Type:Enzyme
Mol. Mass.:56860.34
Organism:Homo sapiens (Human)
Description:P05181
Residue:493
BDBM50380515
NameBDBM50380515
Synonyms:CHEMBL2019024
TypeSmall organic molecule
Emp. Form.C14H13N3S
Mol. Mass.255.338
SMILESCc1ccc2nc(SCc3ccccn3)[nH]c2c1