Reaction Details
TargetCholinesterase
LigandBDBM50380546
Substrate/Competitorn/a
Meas. Tech.ChEMBL_813112 (CHEMBL2020731)
IC50 0.35±n/a nM
Citation Fernández-Bachiller, MIPérez, CMonjas, LRademann, JRodríguez-Franco, MI New tacrine-4-oxo-4H-chromene hybrids as multifunctional agents for the treatment of Alzheimer's disease, with cholinergic, antioxidant, andß-amyloid-reducing properties. J Med Chem55:1303-17 (2012) 
 
Cholinesterase
Name:Cholinesterase
Type:Enzyme
Mol. Mass.:65643.35
Organism:Equus caballus (Horse)
Description:P81908
Residue:574
BDBM50380546
NameBDBM50380546
Synonyms:CHEMBL2019047
TypeSmall organic molecule
Emp. Form.C33H39N3O5
Mol. Mass.557.6799
SMILESOc1cc(O)c2c(c1)oc(cc2=O)C(=O)NCCCCCCCCCCNc1c2CCCCc2nc2ccccc12