Reaction Details
TargetCholinesterase
LigandBDBM50380552
Substrate/Competitorn/a
Meas. Tech.ChEMBL_813112 (CHEMBL2020731)
IC50 0.43±n/a nM
Citation Fernández-Bachiller, MIPérez, CMonjas, LRademann, JRodríguez-Franco, MI New tacrine-4-oxo-4H-chromene hybrids as multifunctional agents for the treatment of Alzheimer's disease, with cholinergic, antioxidant, andß-amyloid-reducing properties. J Med Chem55:1303-17 (2012) 
 
Cholinesterase
Name:Cholinesterase
Type:Enzyme
Mol. Mass.:65643.35
Organism:Equus caballus (Horse)
Description:P81908
Residue:574
BDBM50380552
NameBDBM50380552
Synonyms:CHEMBL2019035
TypeSmall organic molecule
Emp. Form.C34H40ClN3O4
Mol. Mass.590.152
SMILESCOc1ccc2oc(cc(=O)c2c1)C(=O)NCCCCCCCCCCNc1c2CCCCc2nc2cc(Cl)ccc12