Reaction Details
TargetCholinesterase
LigandBDBM50380541
Substrate/Competitorn/a
Meas. Tech.ChEMBL_813112 (CHEMBL2020731)
IC50 0.18±n/a nM
Citation Fernández-Bachiller, MIPérez, CMonjas, LRademann, JRodríguez-Franco, MI New tacrine-4-oxo-4H-chromene hybrids as multifunctional agents for the treatment of Alzheimer's disease, with cholinergic, antioxidant, andß-amyloid-reducing properties. J Med Chem55:1303-17 (2012) 
 
Cholinesterase
Name:Cholinesterase
Type:Enzyme
Mol. Mass.:65643.35
Organism:Equus caballus (Horse)
Description:P81908
Residue:574
BDBM50380541
NameBDBM50380541
Synonyms:CHEMBL2019032
TypeSmall organic molecule
Emp. Form.C33H38ClN3O3
Mol. Mass.560.126
SMILESClc1ccc2c(NCCCCCCCCCCNC(=O)c3cc(=O)c4ccccc4o3)c3CCCCc3nc2c1