Reaction Details
TargetCholinesterase
LigandBDBM50380551
Substrate/Competitorn/a
Meas. Tech.ChEMBL_813114 (CHEMBL2020733)
IC50 0.10±n/a nM
Citation Fernández-Bachiller, MIPérez, CMonjas, LRademann, JRodríguez-Franco, MI New tacrine-4-oxo-4H-chromene hybrids as multifunctional agents for the treatment of Alzheimer's disease, with cholinergic, antioxidant, andß-amyloid-reducing properties. J Med Chem55:1303-17 (2012) 
 
Cholinesterase
Name:Cholinesterase
Type:Homotetramer
Mol. Mass.:68422.27
Organism:Homo sapiens (Human)
Description:P06276
Residue:602
BDBM50380551
NameBDBM50380551
Synonyms:CHEMBL2019038
TypeSmall organic molecule
Emp. Form.C35H42ClN3O5
Mol. Mass.620.178
SMILESCOc1cc(OC)c2c(c1)oc(cc2=O)C(=O)NCCCCCCCCCCNc1c2CCCCc2nc2cc(Cl)ccc12