Reaction Details
TargetCholinesterase
LigandBDBM50380537
Substrate/Competitorn/a
Meas. Tech.ChEMBL_813114 (CHEMBL2020733)
IC50 0.15±n/a nM
Citation Fernández-Bachiller, MIPérez, CMonjas, LRademann, JRodríguez-Franco, MI New tacrine-4-oxo-4H-chromene hybrids as multifunctional agents for the treatment of Alzheimer's disease, with cholinergic, antioxidant, andß-amyloid-reducing properties. J Med Chem55:1303-17 (2012) 
 
Cholinesterase
Name:Cholinesterase
Type:Homotetramer
Mol. Mass.:68422.27
Organism:Homo sapiens (Human)
Description:P06276
Residue:602
BDBM50380537
NameBDBM50380537
Synonyms:CHEMBL2019030
TypeSmall organic molecule
Emp. Form.C33H39N3O3
Mol. Mass.525.6811
SMILESO=C(NCCCCCCCCCCNc1c2CCCCc2nc2ccccc12)c1cc(=O)c2ccccc2o1