Reaction Details
TargetPoly [ADP-ribose] polymerase tankyrase-1
LigandBDBM50318567
Substrate/Competitorn/a
Meas. Tech.ChEMBL_813154 (CHEMBL2020820)
IC50 13±n/a nM
Citation Shultz, MDKirby, CAStams, TChin, DNBlank, JCharlat, OCheng, HCheung, ACong, FFeng, YFortin, PDHood, TTyagi, VXu, MZhang, BShao, W [1,2,4]triazol-3-ylsulfanylmethyl)-3-phenyl-[1,2,4]oxadiazoles: antagonists of the Wnt pathway that inhibit tankyrases 1 and 2 via novel adenosine pocket binding. J Med Chem55:1127-36 (2012) 
 
Poly [ADP-ribose] polymerase tankyrase-1
Name:Poly [ADP-ribose] polymerase tankyrase-1
Type:Enzyme
Mol. Mass.:142058.03
Organism:Homo sapiens (Human)
Description:O95271
Residue:1327
BDBM50318567
NameBDBM50318567
Synonyms:2-(4-(Trifluoromethyl)phenyl)-7,8-dihydro-5H-thiopyrano-[4,3-d]pyrimidin-4-ol CHEMBL1086580
TypeSmall organic molecule
Emp. Form.C14H11F3N2OS
Mol. Mass.312.31
SMILESFC(F)(F)c1ccc(cc1)-c1nc2CCSCc2c(=O)[nH]1