Reaction Details
TargetPlasminogen
LigandBDBM50380618
Substrate/Competitorn/a
Meas. Tech.ChEMBL_813172 (CHEMBL2020838)
Ki 6.9±n/a nM
Citation Saupe, SMSteinmetzer, T A new strategy for the development of highly potent and selective plasmin inhibitors. J Med Chem55:1171-80 (2012) 
 
Plasminogen
Name:Plasminogen
Type:Enzyme
Mol. Mass.:90579.18
Organism:Homo sapiens (Human)
Description:n/a
Residue:810
BDBM50380618
NameBDBM50380618
Synonyms:CHEMBL2016868
TypeSmall organic molecule
Emp. Form.C45H47N7O6S
Mol. Mass.813.963
SMILESNC(=N)c1ccc(CNC(=O)[C@@H]2Cc3cccc(CNC(=O)Cc4ccc(CC(=O)NCc5cccc(C[C@@H](NS(=O)(=O)Cc6ccccc6)C(=O)N2)c5)cc4)c3)cc1