Reaction Details
TargetPlasma kallikrein
LigandBDBM50380619
Substrate/Competitorn/a
Meas. Tech.ChEMBL_813173 (CHEMBL2020839)
Ki 0.075±n/a nM
Citation Saupe, SMSteinmetzer, T A new strategy for the development of highly potent and selective plasmin inhibitors. J Med Chem55:1171-80 (2012) 
 
Plasma kallikrein
Name:Plasma kallikrein
Type:Protein
Mol. Mass.:71391.16
Organism:Homo sapiens (Human)
Description:P03952
Residue:638
BDBM50380619
NameBDBM50380619
Synonyms:CHEMBL2016865
TypeSmall organic molecule
Emp. Form.C38H44N8O6S
Mol. Mass.740.871
SMILES[#7]\[#6](-[#7])=[#7]\[#6]-c1cccc(-[#6]-[#6@H](-[#7]-[#6](=O)-[#6@@H](-[#6]-[#6]-[#6]-c2ccccc2)-[#7]S(=O)(=O)[#6]-c2cccc(c2)-[#6](-[#8])=O)-[#6](=O)-[#7]-[#6]-c2ccc(cc2)-[#6](-[#7])=[#7])c1