Reaction Details
TargetPlasma kallikrein
LigandBDBM50380620
Substrate/Competitorn/a
Meas. Tech.ChEMBL_813173 (CHEMBL2020839)
Ki 25.4±n/a nM
Citation Saupe, SMSteinmetzer, T A new strategy for the development of highly potent and selective plasmin inhibitors. J Med Chem55:1171-80 (2012) 
 
Plasma kallikrein
Name:Plasma kallikrein
Type:Protein
Mol. Mass.:71391.16
Organism:Homo sapiens (Human)
Description:P03952
Residue:638
BDBM50380620
NameBDBM50380620
Synonyms:CHEMBL2016866
TypeSmall organic molecule
Emp. Form.C33H39N7O6S
Mol. Mass.661.771
SMILESNC(=N)c1ccc(CNC(=O)[C@@H]2CCC(=O)NCc3cccc(CNC(=O)CC[C@@H](NS(=O)(=O)Cc4ccccc4)C(=O)N2)c3)cc1