Reaction Details
TargetProthrombin
LigandBDBM50380620
Substrate/Competitorn/a
Meas. Tech.ChEMBL_813174 (CHEMBL2020840)
Ki 2020±n/a nM
Citation Saupe, SMSteinmetzer, T A new strategy for the development of highly potent and selective plasmin inhibitors. J Med Chem55:1171-80 (2012) 
 
Prothrombin
Name:Prothrombin
Type:Protein
Mol. Mass.:70029.57
Organism:Homo sapiens (Human)
Description:P00734
Residue:622
BDBM50380620
NameBDBM50380620
Synonyms:CHEMBL2016866
TypeSmall organic molecule
Emp. Form.C33H39N7O6S
Mol. Mass.661.771
SMILESNC(=N)c1ccc(CNC(=O)[C@@H]2CCC(=O)NCc3cccc(CNC(=O)CC[C@@H](NS(=O)(=O)Cc4ccccc4)C(=O)N2)c3)cc1