Reaction Details
TargetCoagulation factor X
LigandBDBM50380617
Substrate/Competitorn/a
Meas. Tech.ChEMBL_813175 (CHEMBL2020841)
Ki 206±n/a nM
Citation Saupe, SMSteinmetzer, T A new strategy for the development of highly potent and selective plasmin inhibitors. J Med Chem55:1171-80 (2012) 
 
Coagulation factor X
Name:Coagulation factor X
Type:Enzyme
Mol. Mass.:54726.60
Organism:Homo sapiens (Human)
Description:n/a
Residue:488
BDBM50380617
NameBDBM50380617
Synonyms:CHEMBL2016873
TypeSmall organic molecule
Emp. Form.C33H35N11O4S
Mol. Mass.681.767
SMILESNC(=N)c1ccc(CNC(=O)[C@@H]2Cc3cn(Cc4cccc(Cn5cc(C[C@@H](NS(=O)(=O)Cc6ccccc6)C(=O)N2)nn5)c4)nn3)cc1