Reaction Details
TargetcAMP and cAMP-inhibited cGMP 3',5'-cyclic phosphodiesterase 10A
LigandBDBM50380636
Substrate/Competitorn/a
Meas. Tech.ChEMBL_813179 (CHEMBL2020845)
Ki 1.5±n/a nM
Citation Ho, GDMichael Seganish, WBercovici, ATulshian, DGreenlee, WJVan Rijn, RHruza, AXiao, LRindgen, DMullins, DGuzzi, MZhang, XBleickardt, CHodgson, R The SAR development of dihydroimidazoisoquinoline derivatives as phosphodiesterase 10A inhibitors for the treatment of schizophrenia. Bioorg Med Chem Lett22:2585-9 (2012) 
 
cAMP and cAMP-inhibited cGMP 3',5'-cyclic phosphodiesterase 10A
Name:cAMP and cAMP-inhibited cGMP 3',5'-cyclic phosphodiesterase 10A
Type:Protein
Mol. Mass.:88412.52
Organism:Homo sapiens (Human)
Description:Q9Y233
Residue:779
BDBM50380636
NameBDBM50380636
Synonyms:CHEMBL2017060
TypeSmall organic molecule
Emp. Form.C22H24N4O4S
Mol. Mass.440.515
SMILESCOc1cc2CCn3cnc(-c4cnc(s4)C(=O)N4CCCOCC4)c3-c2cc1OC