Reaction Details
TargetHigh affinity cAMP-specific 3',5'-cyclic phosphodiesterase 7A
LigandBDBM50380635
Substrate/Competitorn/a
Meas. Tech.ChEMBL_813181 (CHEMBL2020847)
Ki 613±n/a nM
Citation Ho, GDMichael Seganish, WBercovici, ATulshian, DGreenlee, WJVan Rijn, RHruza, AXiao, LRindgen, DMullins, DGuzzi, MZhang, XBleickardt, CHodgson, R The SAR development of dihydroimidazoisoquinoline derivatives as phosphodiesterase 10A inhibitors for the treatment of schizophrenia. Bioorg Med Chem Lett22:2585-9 (2012) 
 
High affinity cAMP-specific 3',5'-cyclic phosphodiesterase 7A
Name:High affinity cAMP-specific 3',5'-cyclic phosphodiesterase 7A
Type:Enzyme
Mol. Mass.:55514.96
Organism:Homo sapiens (Human)
Description:Q13946
Residue:482
BDBM50380635
NameBDBM50380635
Synonyms:CHEMBL2017059
TypeSmall organic molecule
Emp. Form.C21H22N4O4S
Mol. Mass.426.489
SMILESCOc1cc2CCn3cnc(-c4cnc(s4)C(=O)N4CCOCC4)c3-c2cc1OC