Reaction Details
TargetCytochrome P450 3A4
LigandBDBM50380664
Substrate/Competitorn/a
Meas. Tech.ChEMBL_813216 (CHEMBL2020948)
IC50 2000±n/a nM
Citation Mirguet, OLamotte, YDonche, FToum, JGellibert, FBouillot, AGosmini, RNguyen, VLDelannée, DSeal, JBlandel, FBoullay, ABBoursier, EMartin, SBrusq, JMKrysa, GRiou, ATellier, RCostaz, AHuet, PDudit, YTrottet, LKirilovsky, JNicodeme, E From ApoA1 upregulation to BET family bromodomain inhibition: discovery of I-BET151. Bioorg Med Chem Lett22:2963-7 (2012) 
 
Cytochrome P450 3A4
Name:Cytochrome P450 3A4
Type:Enzyme
Mol. Mass.:57349.57
Organism:Homo sapiens (Human)
Description:n/a
Residue:503
BDBM50380664
NameBDBM50380664
Synonyms:CHEMBL2017287
TypeSmall organic molecule
Emp. Form.C24H22N4O3
Mol. Mass.414.4565
SMILESCOc1cc2c3n(C(C)c4ccccc4)c(=O)[nH]c3cnc2cc1-c1c(C)noc1C