Reaction Details
TargetCytochrome P450 2C9
LigandBDBM50380665
Substrate/Competitorn/a
Meas. Tech.ChEMBL_813215 (CHEMBL2020947)
IC50 2100±n/a nM
Citation Mirguet, OLamotte, YDonche, FToum, JGellibert, FBouillot, AGosmini, RNguyen, VLDelannée, DSeal, JBlandel, FBoullay, ABBoursier, EMartin, SBrusq, JMKrysa, GRiou, ATellier, RCostaz, AHuet, PDudit, YTrottet, LKirilovsky, JNicodeme, E From ApoA1 upregulation to BET family bromodomain inhibition: discovery of I-BET151. Bioorg Med Chem Lett22:2963-7 (2012) 
 
Cytochrome P450 2C9
Name:Cytochrome P450 2C9
Type:Enzyme
Mol. Mass.:55636.33
Organism:Homo sapiens (Human)
Description:P11712
Residue:490
BDBM50380665
NameBDBM50380665
Synonyms:CHEMBL2017089
TypeSmall organic molecule
Emp. Form.C21H18N4O2
Mol. Mass.358.3932
SMILESCc1noc(C)c1-c1ccc2c(Nc3ccccc3)c(cnc2c1)C(N)=O