Reaction Details
TargetCytochrome P450 2C9
LigandBDBM50380670
Substrate/Competitorn/a
Meas. Tech.ChEMBL_813215 (CHEMBL2020947)
IC50 1200±n/a nM
Citation Mirguet, OLamotte, YDonche, FToum, JGellibert, FBouillot, AGosmini, RNguyen, VLDelannée, DSeal, JBlandel, FBoullay, ABBoursier, EMartin, SBrusq, JMKrysa, GRiou, ATellier, RCostaz, AHuet, PDudit, YTrottet, LKirilovsky, JNicodeme, E From ApoA1 upregulation to BET family bromodomain inhibition: discovery of I-BET151. Bioorg Med Chem Lett22:2963-7 (2012) 
 
Cytochrome P450 2C9
Name:Cytochrome P450 2C9
Type:Enzyme
Mol. Mass.:55636.33
Organism:Homo sapiens (Human)
Description:P11712
Residue:490
BDBM50380670
NameBDBM50380670
Synonyms:CHEMBL2017274
TypeSmall organic molecule
Emp. Form.C26H28N4O3
Mol. Mass.444.5255
SMILESCOc1cc2c(Nc3ccccc3C(C)(C)C)c(cnc2cc1-c1c(C)noc1C)C(N)=O