Reaction Details
TargetCytochrome P450 3A4
LigandBDBM50380676
Substrate/Competitorn/a
Meas. Tech.ChEMBL_813216 (CHEMBL2020948)
IC50 1700±n/a nM
Citation Mirguet, OLamotte, YDonche, FToum, JGellibert, FBouillot, AGosmini, RNguyen, VLDelannée, DSeal, JBlandel, FBoullay, ABBoursier, EMartin, SBrusq, JMKrysa, GRiou, ATellier, RCostaz, AHuet, PDudit, YTrottet, LKirilovsky, JNicodeme, E From ApoA1 upregulation to BET family bromodomain inhibition: discovery of I-BET151. Bioorg Med Chem Lett22:2963-7 (2012) 
 
Cytochrome P450 3A4
Name:Cytochrome P450 3A4
Type:Enzyme
Mol. Mass.:57349.57
Organism:Homo sapiens (Human)
Description:n/a
Residue:503
BDBM50380676
NameBDBM50380676
Synonyms:CHEMBL2017283
TypeSmall organic molecule
Emp. Form.C26H26N4O3
Mol. Mass.442.5096
SMILESCOc1cc2c3n(-c4ccccc4C(C)(C)C)c(=O)[nH]c3cnc2cc1-c1c(C)noc1C