Reaction Details
TargetCannabinoid receptor 1
LigandBDBM50380719
Substrate/Competitorn/a
Meas. Tech.ChEMBL_813334 (CHEMBL2019455)
Ki 3.98±n/a nM
Citation Adam, JMClark, JKDavies, KEverett, KFields, RFrancis, SJeremiah, FKiyoi, TMaidment, MMorrison, ARatcliffe, PProsser, ASchulz, JWishart, GBaker, JBoyce, SCampbell, RCottney, JEDeehan, MMartin, I Low brain penetrant CB1 receptor agonists for the treatment of neuropathic pain. Bioorg Med Chem Lett22:2932-7 (2012) 
 
Cannabinoid receptor 1
Name:Cannabinoid receptor 1
Type:G Protein-Coupled Receptor (GPCR)
Mol. Mass.:52868.96
Organism:Homo sapiens (Human)
Description:P21554
Residue:472
BDBM50380719
NameBDBM50380719
Synonyms:CHEMBL1682275
TypeSmall organic molecule
Emp. Form.C25H32ClN5O4
Mol. Mass.502.006
SMILESOCCNC(=O)C1CCN(Cc2nc(no2)-c2cn(CC3CCOCC3)c3c(Cl)cccc23)CC1