Reaction Details
TargetOxytocin receptor
LigandBDBM50380760
Substrate/Competitorn/a
Meas. Tech.ChEMBL_813468 (CHEMBL2019476)
Ki 18±n/a nM
Citation Smith, ALFreeman, SMStehouwer, JSInoue, KVoll, RJYoung, LJGoodman, MM Synthesis and evaluation of C-11, F-18 and I-125 small molecule radioligands for detecting oxytocin receptors. Bioorg Med Chem20:2721-38 (2012) 
 
Oxytocin receptor
Name:Oxytocin receptor
Synonyms:OTR
Type:PROTEIN
Mol. Mass.:28131.82
Organism:Microtus ochrogaster
Description:ChEMBL_813468
Residue:259
BDBM50380760
NameBDBM50380760
Synonyms:CHEMBL2017979
TypeSmall organic molecule
Emp. Form.C29H37N3O6S
Mol. Mass.555.686
SMILESCOc1cc(OC2CCN(CC2)S(C)(=O)=O)ccc1CC(=O)N1CCC(CC1)N1C(=O)CCc2ccccc12