Reaction Details
TargetCalcitonin gene-related peptide type 1 receptor
LigandBDBM50380831
Substrate/Competitorn/a
Meas. Tech.ChEMBL_813802 (CHEMBL2020110)
IC50 0.049±n/a nM
Citation Luo, GChen, LPin, SSXu, CConway, CMMacor, JEDubowchik, GM Calcitonin gene-related peptide (CGRP) receptor antagonists: novel aspartates and succinates. Bioorg Med Chem Lett22:2912-6 (2012) 
 
Calcitonin gene-related peptide type 1 receptor
Name:Calcitonin gene-related peptide type 1 receptor
Type:Enzyme Catalytic Domain
Mol. Mass.:52980.45
Organism:Homo sapiens (Human)
Description:Q16602
Residue:461
BDBM50380831
NameBDBM50380831
Synonyms:CHEMBL2018507
TypeSmall organic molecule
Emp. Form.C37H47N7O3
Mol. Mass.637.8142
SMILESCc1cc(CC(CC(=O)N2CCC(CC2)n2cc([nH]c2=O)-c2ccccc2)C(=O)N2CCC(CC2)N2CCCCC2)cc2cn[nH]c12