Reaction Details
TargetCalcitonin gene-related peptide type 1 receptor
LigandBDBM50380820
Substrate/Competitorn/a
Meas. Tech.ChEMBL_813802 (CHEMBL2020110)
IC50 0.082±n/a nM
Citation Luo, GChen, LPin, SSXu, CConway, CMMacor, JEDubowchik, GM Calcitonin gene-related peptide (CGRP) receptor antagonists: novel aspartates and succinates. Bioorg Med Chem Lett22:2912-6 (2012) 
 
Calcitonin gene-related peptide type 1 receptor
Name:Calcitonin gene-related peptide type 1 receptor
Type:Enzyme Catalytic Domain
Mol. Mass.:52980.45
Organism:Homo sapiens (Human)
Description:Q16602
Residue:461
BDBM50380820
NameBDBM50380820
Synonyms:CHEMBL2018519
TypeSmall organic molecule
Emp. Form.C36H46FN7O3
Mol. Mass.643.7939
SMILESCc1cc(C[C@@H](CC(=O)N2CCC(CC2)N2Cc3cccc(F)c3NC2=O)C(=O)N2CCC(CC2)N2CCCCC2)cc2cn[nH]c12