Reaction Details
TargetC-C chemokine receptor type 4
LigandBDBM50380878
Substrate/Competitorn/a
Meas. Tech.ChEMBL_812670 (CHEMBL2019171)
Ki 158.49±n/a nM
Citation Procopiou, PAFord, AJGraves, RHHall, DAHodgson, STLacroix, YMNeedham, DSlack, RJ Lead optimisation of the N1 substituent of a novel series of indazole arylsulfonamides as CCR4 antagonists and identification of a candidate for clinical investigation. Bioorg Med Chem Lett22:2730-3 (2012) 
 
C-C chemokine receptor type 4
Name:C-C chemokine receptor type 4
Type:Enzyme
Mol. Mass.:41406.41
Organism:Homo sapiens (Human)
Description:P51679
Residue:360
BDBM50380878
NameBDBM50380878
Synonyms:CHEMBL2018966
TypeSmall organic molecule
Emp. Form.C22H21ClN4O4S2
Mol. Mass.505.01
SMILESCOc1cccc2n(Cc3ccc(CNC(C)=O)cc3)nc(NS(=O)(=O)c3ccc(Cl)s3)c12