Reaction Details
TargetC-C chemokine receptor type 4
LigandBDBM50380884
Substrate/Competitorn/a
Meas. Tech.ChEMBL_812672 (CHEMBL2019173)
Kd 251.19±n/a nM
Citation Procopiou, PAFord, AJGraves, RHHall, DAHodgson, STLacroix, YMNeedham, DSlack, RJ Lead optimisation of the N1 substituent of a novel series of indazole arylsulfonamides as CCR4 antagonists and identification of a candidate for clinical investigation. Bioorg Med Chem Lett22:2730-3 (2012) 
 
C-C chemokine receptor type 4
Name:C-C chemokine receptor type 4
Type:Enzyme
Mol. Mass.:41406.41
Organism:Homo sapiens (Human)
Description:P51679
Residue:360
BDBM50380884
NameBDBM50380884
Synonyms:CHEMBL2018954
TypeSmall organic molecule
Emp. Form.C23H27BrN4O5S
Mol. Mass.551.453
SMILESCOc1ccc(COc2nc(Br)cnc2NS(=O)(=O)c2ccc(C)cc2)cc1OCCN(C)C