Reaction Details
TargetC-C chemokine receptor type 4
LigandBDBM50380880
Substrate/Competitorn/a
Meas. Tech.ChEMBL_812672 (CHEMBL2019173)
Kd 630.96±n/a nM
Citation Procopiou, PAFord, AJGraves, RHHall, DAHodgson, STLacroix, YMNeedham, DSlack, RJ Lead optimisation of the N1 substituent of a novel series of indazole arylsulfonamides as CCR4 antagonists and identification of a candidate for clinical investigation. Bioorg Med Chem Lett22:2730-3 (2012) 
 
C-C chemokine receptor type 4
Name:C-C chemokine receptor type 4
Type:Enzyme
Mol. Mass.:41406.41
Organism:Homo sapiens (Human)
Description:P51679
Residue:360
BDBM50380880
NameBDBM50380880
Synonyms:CHEMBL2018969
TypeSmall organic molecule
Emp. Form.C24H25ClN4O5S2
Mol. Mass.549.062
SMILESCOc1cccc2n(Cc3cccc(CNC(=O)C(C)(C)O)c3)nc(NS(=O)(=O)c3ccc(Cl)s3)c12