Reaction Details
TargetCannabinoid receptor 2
LigandBDBM50380895
Substrate/Competitorn/a
Meas. Tech.ChEMBL_812808 (CHEMBL2020075)
Ki 177±n/a nM
Citation Odan, MIshizuka, NHiramatsu, YInagaki, MHashizume, HFujii, YMitsumori, SMorioka, YSoga, MDeguchi, MYasui, KArimura, A Discovery of S-777469: an orally available CB2 agonist as an antipruritic agent. Bioorg Med Chem Lett22:2803-6 (2012) 
 
Cannabinoid receptor 2
Name:Cannabinoid receptor 2
Type:G Protein-Coupled Receptor (GPCR)
Mol. Mass.:39690.94
Organism:Homo sapiens (Human)
Description:P34972
Residue:360
BDBM50380895
NameBDBM50380895
Synonyms:CHEMBL2019079
TypeSmall organic molecule
Emp. Form.C21H30N2O4
Mol. Mass.374.4739
SMILESOC(=O)CNC(=O)c1cc2CCCCCCc2n(CC2CCCCC2)c1=O