Reaction Details
TargetCannabinoid receptor 2
LigandBDBM50380888
Substrate/Competitorn/a
Meas. Tech.ChEMBL_812808 (CHEMBL2020075)
Ki 294±n/a nM
Citation Odan, MIshizuka, NHiramatsu, YInagaki, MHashizume, HFujii, YMitsumori, SMorioka, YSoga, MDeguchi, MYasui, KArimura, A Discovery of S-777469: an orally available CB2 agonist as an antipruritic agent. Bioorg Med Chem Lett22:2803-6 (2012) 
 
Cannabinoid receptor 2
Name:Cannabinoid receptor 2
Type:G Protein-Coupled Receptor (GPCR)
Mol. Mass.:39690.94
Organism:Homo sapiens (Human)
Description:P34972
Residue:360
BDBM50380888
NameBDBM50380888
Synonyms:CHEMBL2019092
TypeSmall organic molecule
Emp. Form.C22H32N2O5
Mol. Mass.404.4999
SMILESCOCCn1c2CCCCCCc2cc(C(=O)NC2(CCCCC2)C(O)=O)c1=O