Reaction Details
TargetCannabinoid receptor 2
LigandBDBM50380897
Substrate/Competitorn/a
Meas. Tech.ChEMBL_812808 (CHEMBL2020075)
Ki 247±n/a nM
Citation Odan, MIshizuka, NHiramatsu, YInagaki, MHashizume, HFujii, YMitsumori, SMorioka, YSoga, MDeguchi, MYasui, KArimura, A Discovery of S-777469: an orally available CB2 agonist as an antipruritic agent. Bioorg Med Chem Lett22:2803-6 (2012) 
 
Cannabinoid receptor 2
Name:Cannabinoid receptor 2
Type:G Protein-Coupled Receptor (GPCR)
Mol. Mass.:39690.94
Organism:Homo sapiens (Human)
Description:P34972
Residue:360
BDBM50380897
NameBDBM50380897
Synonyms:CHEMBL2019084
TypeSmall organic molecule
Emp. Form.C24H34N2O5
Mol. Mass.430.5372
SMILESOC(=O)C1(CCCCC1)NC(=O)c1cc2CCCCCCc2n(CC2CCCO2)c1=O