Reaction Details
TargetCannabinoid receptor 1
LigandBDBM50380896
Substrate/Competitorn/a
Meas. Tech.ChEMBL_812809 (CHEMBL2020076)
IC50 76±n/a nM
Citation Odan, MIshizuka, NHiramatsu, YInagaki, MHashizume, HFujii, YMitsumori, SMorioka, YSoga, MDeguchi, MYasui, KArimura, A Discovery of S-777469: an orally available CB2 agonist as an antipruritic agent. Bioorg Med Chem Lett22:2803-6 (2012) 
 
Cannabinoid receptor 1
Name:Cannabinoid receptor 1
Type:G Protein-Coupled Receptor (GPCR)
Mol. Mass.:52868.96
Organism:Homo sapiens (Human)
Description:P21554
Residue:472
BDBM50380896
NameBDBM50380896
Synonyms:CHEMBL2019081
TypeSmall organic molecule
Emp. Form.C26H38N2O4
Mol. Mass.442.5909
SMILESOC(=O)C1(CCCCC1)NC(=O)c1cc2CCCCCCc2n(CC2CCCCC2)c1=O