Reaction Details
TargetCannabinoid receptor 2
LigandBDBM50326618
Substrate/Competitorn/a
Meas. Tech.ChEMBL_812829 (CHEMBL2020150)
Ki 0.64±n/a nM
Citation Odan, MIshizuka, NHiramatsu, YInagaki, MHashizume, HFujii, YMitsumori, SMorioka, YSoga, MDeguchi, MYasui, KArimura, A Discovery of S-777469: an orally available CB2 agonist as an antipruritic agent. Bioorg Med Chem Lett22:2803-6 (2012) 
 
Cannabinoid receptor 2
Name:Cannabinoid receptor 2
Type:G Protein-Coupled Receptor (GPCR)
Mol. Mass.:39690.94
Organism:Homo sapiens (Human)
Description:P34972
Residue:360
BDBM50326618
NameBDBM50326618
Synonyms:CHEMBL1254015 | [11C]-3-(2-methoxyethyl)-4,5-dimethyl-3H-thiazol-(2Z)-ylidene]amide]
TypeSmall organic molecule
Emp. Form.C16H26N2O2S
Mol. Mass.310.455
SMILESCOCCn1c(C)c(C)sc1=NC(=O)C1C(C)(C)C1(C)C