Reaction Details
TargetDelta-type opioid receptor
LigandBDBM50380909
Substrate/Competitorn/a
Meas. Tech.ChEMBL_813972 (CHEMBL2020484)
Ki 0.74±n/a nM
Citation Watanabe, YKitazawa, SFujii, HNemoto, THirayama, SNagase, H Design and synthesis of novel opioid ligands with an azabicyclo[2.2.2]octane skeleton and their pharmacologies. Bioorg Med Chem Lett22:2689-92 (2012) 
 
Delta-type opioid receptor
Name:Delta-type opioid receptor
Type:Enzyme Catalytic Domain
Mol. Mass.:40577.25
Organism:MOUSE
Description:P32300
Residue:372
BDBM50380909
NameBDBM50380909
Synonyms:CHEMBL2016678
TypeSmall organic molecule
Emp. Form.C25H32N2O3
Mol. Mass.408.5332
SMILESOc1ccc2C[C@H]3N(CC4CC4)CC[C@@]45[C@@H](Oc1c24)[C@@]1(O)CC[C@@]35N(CC2CC2)C1