Reaction Details
TargetKappa-type opioid receptor
LigandBDBM50380908
Substrate/Competitorn/a
Meas. Tech.ChEMBL_813971 (CHEMBL2020483)
Ki 9.91±n/a nM
Citation Watanabe, YKitazawa, SFujii, HNemoto, THirayama, SNagase, H Design and synthesis of novel opioid ligands with an azabicyclo[2.2.2]octane skeleton and their pharmacologies. Bioorg Med Chem Lett22:2689-92 (2012) 
 
Kappa-type opioid receptor
Name:Kappa-type opioid receptor
Type:G Protein-Coupled Receptor (GPCR)
Mol. Mass.:42744.99
Organism:Cavia porcellus (domestic guinea pig)
Description:P41144
Residue:380
BDBM50380908
NameBDBM50380908
Synonyms:CHEMBL2016677
TypeSmall organic molecule
Emp. Form.C25H30N2O4
Mol. Mass.422.5167
SMILESOc1ccc2C[C@H]3N(CC4CC4)CC[C@@]45[C@@H](Oc1c24)[C@@]1(O)CC[C@@]35N(C1)C(=O)C1CC1