Reaction Details
TargetNeuropeptide Y receptor type 5
LigandBDBM50380918
Substrate/Competitorn/a
Meas. Tech.ChEMBL_813976 (CHEMBL2020488)
Ki 10±n/a nM
Citation Fichtner, MLee, ETomlinson, EScott, DCornelius, PPatterson, TACarpino, PA Discovery and evaluation of spirocyclic derivatives as antagonists of the neuropeptide Y5 receptor. Bioorg Med Chem Lett22:2738-43 (2012) 
 
Neuropeptide Y receptor type 5
Name:Neuropeptide Y receptor type 5
Type:Enzyme
Mol. Mass.:50746.64
Organism:Homo sapiens (Human)
Description:Q15761
Residue:445
BDBM50380918
NameBDBM50380918
Synonyms:CHEMBL2016735
TypeSmall organic molecule
Emp. Form.C24H25FN4O2
Mol. Mass.420.4793
SMILESCN([C@H]1CC[C@]2(CC1)OCc1ccccc21)C(=O)Nc1ccn(n1)-c1ccccc1F