Reaction Details
TargetVascular endothelial growth factor receptor 2
LigandBDBM50380974
Substrate/Competitorn/a
Meas. Tech.ChEMBL_814082 (CHEMBL2020676)
IC50 0.3±n/a nM
Citation Han, SYChoi, JWYang, JChae, CHLee, JJung, HLee, KHa, JDKim, HRCho, SY Design and synthesis of 3-(4,5,6,7-tetrahydro-3H-imidazo[4,5-c]pyridin-2-yl)-1H-quinolin-2-ones as VEGFR-2 kinase inhibitors. Bioorg Med Chem Lett22:2837-42 (2012) 
 
Vascular endothelial growth factor receptor 2
Name:Vascular endothelial growth factor receptor 2
Type:Receptor Tyrosine Kinase
Mol. Mass.:151510.97
Organism:Homo sapiens (Human)
Description:P35968
Residue:1356
BDBM50380974
NameBDBM50380974
Synonyms:CHEMBL2016903
TypeSmall organic molecule
Emp. Form.C21H16FN5O2
Mol. Mass.389.3824
SMILESFc1ccc2[nH]c(=O)c(cc2c1)-c1nc2CCN(Cc2[nH]1)C(=O)c1ccncc1