Reaction Details
TargetPotassium voltage-gated channel subfamily H member 2
LigandBDBM50380978
Substrate/Competitorn/a
Meas. Tech.ChEMBL_814101 (CHEMBL2020695)
Ki 9800±n/a nM
Citation Fournier, PAArbour, MCauchon, EChen, AChefson, ADucharme, YFalgueyret, JPGagné, SGrimm, EHan, YHoule, RLacombe, PLévesque, JFMacDonald, DMackay, BMcKay, DPercival, MDRamtohul, YSt-Jacques, RToulmond, S Design and synthesis of potent, isoxazole-containing renin inhibitors. Bioorg Med Chem Lett22:2670-4 (2012) 
 
Potassium voltage-gated channel subfamily H member 2
Name:Potassium voltage-gated channel subfamily H member 2
Type:Multi-pass membrane protein
Mol. Mass.:126672.65
Organism:Homo sapiens (Human)
Description:Q12809
Residue:1159
BDBM50380978
NameBDBM50380978
Synonyms:CHEMBL2017103
TypeSmall organic molecule
Emp. Form.C20H16Cl2F2N2O2
Mol. Mass.425.256
SMILESO[C@@]1(CCNC[C@@H]1c1cc(on1)-c1c(Cl)cccc1Cl)c1ccc(F)c(F)c1