Reaction Details
TargetRenin
LigandBDBM50380982
Substrate/Competitorn/a
Meas. Tech.ChEMBL_814100 (CHEMBL2020694)
IC50 1.2±n/a nM
Citation Fournier, PAArbour, MCauchon, EChen, AChefson, ADucharme, YFalgueyret, JPGagné, SGrimm, EHan, YHoule, RLacombe, PLévesque, JFMacDonald, DMackay, BMcKay, DPercival, MDRamtohul, YSt-Jacques, RToulmond, S Design and synthesis of potent, isoxazole-containing renin inhibitors. Bioorg Med Chem Lett22:2670-4 (2012) 
 
Renin
Name:Renin
Type:Enzyme
Mol. Mass.:45058.99
Organism:Homo sapiens (Human)
Description:n/a
Residue:406
BDBM50380982
NameBDBM50380982
Synonyms:CHEMBL2017110
TypeSmall organic molecule
Emp. Form.C25H26BrF2N3O3
Mol. Mass.534.393
SMILESCO[C@@]1(CCNC[C@@H]1c1noc(c1Br)-c1ccccc1CCNC(C)=O)c1ccc(F)c(F)c1