Reaction Details
TargetPotassium voltage-gated channel subfamily H member 2
LigandBDBM50380981
Substrate/Competitorn/a
Meas. Tech.ChEMBL_814101 (CHEMBL2020695)
Ki 19500±n/a nM
Citation Fournier, PAArbour, MCauchon, EChen, AChefson, ADucharme, YFalgueyret, JPGagné, SGrimm, EHan, YHoule, RLacombe, PLévesque, JFMacDonald, DMackay, BMcKay, DPercival, MDRamtohul, YSt-Jacques, RToulmond, S Design and synthesis of potent, isoxazole-containing renin inhibitors. Bioorg Med Chem Lett22:2670-4 (2012) 
 
Potassium voltage-gated channel subfamily H member 2
Name:Potassium voltage-gated channel subfamily H member 2
Type:Multi-pass membrane protein
Mol. Mass.:126672.65
Organism:Homo sapiens (Human)
Description:Q12809
Residue:1159
BDBM50380981
NameBDBM50380981
Synonyms:CHEMBL2017109
TypeSmall organic molecule
Emp. Form.C24H24BrF2N3O2
Mol. Mass.504.367
SMILESCC(=O)NCCc1ccccc1-c1onc([C@H]2CNCC[C@@H]2c2ccc(F)c(F)c2)c1Br